Target
Carbonic anhydrase
Ligand
BDBM29277
Substrate
Meas. Tech.
ChEMBL_587743 (CHEMBL1038579)
Ki
256±n/a nM
Citation
 Bertucci, AInnocenti, AZoccola, DScozzafava, ATambutté, SSupuran, CT Carbonic anhydrase inhibitors. Inhibition studies of a coral secretory isoform by sulfonamides. Bioorg Med Chem 17:5054-8 (2009)  
Target
Name:
Carbonic anhydrase
Synonyms:
Alpha carbonic anhydrase
Type:
PROTEIN
Mol. Mass.:
36650.57
Organism:
Stylophora pistillata
Description:
ChEMBL_700658
Residue:
323
  
Inhibitor
Name:
BDBM29277
Synonyms:
CHEMBL451332 | sulfonamide, 3
Type:
Small organic molecule
Emp. Form.:
C9H11NO4S
Mol. Mass.:
229.253
SMILES:
NS(=O)(=O)c1ccc(CCC(O)=O)cc1
: