Target
Cyclin-dependent kinase 2/G1/S-specific cyclin-E1/G1/S-specific cyclin-E2
Ligand
BDBM50299139
Substrate
Meas. Tech.
ChEMBL_592015 (CHEMBL1050130)
IC50
24±n/a nM
Citation
 Wittman, MDCarboni, JMYang, ZLee, FYAntman, MAttar, RBalimane, PChang, CChen, CDiscenza, LFrennesson, DGottardis, MMGreer, AHurlburt, WJohnson, WLangley, DRLi, ALi, JLiu, PMastalerz, HMathur, AMenard, KPatel, KSack, JSang, XSaulnier, MSmith, DStefanski, KTrainor, GVelaparthi, UZhang, GZimmermann, KVyas, DM Discovery of a 2,4-disubstituted pyrrolo[1,2-f][1,2,4]triazine inhibitor (BMS-754807) of insulin-like growth factor receptor (IGF-1R) kinase in clinical development. J Med Chem 52:7360-3 (2009)  
Target
Name:
Cyclin-dependent kinase 2/G1/S-specific cyclin-E1/G1/S-specific cyclin-E2
Synonyms:
CDK2/Cyclin E/G1/S-specific cyclin E2 Cyclin-dependent kinase 2/cyclin E
Type:
Mol. Mass.:
Description:
ASSAY_ID of EBI is 52510
Components:
This complex has 3 components.
Component 1
Name:
G1/S-specific cyclin-E2
Synonyms:
CCNE2 CDK3/cyclin E | G1/S-specific cyclin-E2
Type:
PROTEIN
Mol. Mass.:
46763.82
Organism:
Homo sapiens (Human)
Description:
EBI_10135
Residue:
404
  
Component 2
Name:
Cyclin-dependent kinase 2
Synonyms:
CDK2 CDK2_HUMAN Cell division protein kinase 2 Protein cereblon/Cyclin-dependent kinase 2 | p33 protein kinase
Type:
Enzyme Subunit
Mol. Mass.:
33938.17
Organism:
Homo sapiens (Human)
Description:
P24941
Residue:
298
  
Component 3
Name:
G1/S-specific cyclin-E1
Synonyms:
CCNE CCNE1_HUMAN
Type:
Enzyme Subunit
Mol. Mass.:
47073.17
Organism:
Homo sapiens (Human)
Description:
Residue:
410
  
Inhibitor
Name:
BDBM50299139
Synonyms:
(R)-1-(4-(5-cyclopropyl-1H-pyrazol-3-ylamino)pyrrolo[1,2-f][1,2,4]triazin-2-yl)pyrrolidine-2-carboxamide US8592579, 6
Type:
Small organic molecule
Emp. Form.:
C17H20N8O
Mol. Mass.:
352.3937
SMILES:
NC(=O)[C@H]1CCCN1c1nc(Nc2cc([nH]n2)C2CC2)c2cccn2n1
: