Target
Metabotropic glutamate receptor 6
Ligand
BDBM50299481
Substrate
Meas. Tech.
ChEMBL_591059 (CHEMBL1052812)
IC50
3500±n/a nM
Citation
 Briel, DRybak, AKronbach, CUnverferth, K Substituted 2-aminothiopen-derivatives: a potential new class of GluR6-antagonists. Eur J Med Chem 45:69-77 (2010)  
Target
Name:
Metabotropic glutamate receptor 6
Synonyms:
GPRC1F GRM6_HUMAN Metabotropic glutamate receptor 6 metabotropic glutamate 6
Type:
Enzyme Catalytic Domain
Mol. Mass.:
95479.26
Organism:
Homo sapiens (Human)
Description:
metabotropic glutamate 6 GRM6 HUMAN::O15303
Residue:
877
  
Inhibitor
Name:
BDBM50299481
Synonyms:
2-isothiocyanato-4-methyl-5-phenylthiophene-3-carboxylate | CHEMBL579009
Type:
Small organic molecule
Emp. Form.:
C15H13NO2S2
Mol. Mass.:
303.399
SMILES:
CCOC(=O)c1c(C)c(sc1N=C=S)-c1ccccc1
: