Target
Motilin receptor
Ligand
BDBM50299521
Substrate
Meas. Tech.
ChEMBL_591410 (CHEMBL1054530)
EC50
25±n/a nM
Citation
 Shaw, SJChen, YZheng, HFu, HBurlingame, MAMarquez, SLi, YClaypool, MCarreras, CWCrumb, WHardy, DJMyles, DCLiu, Y Structure-activity relationships of 9-substituted-9-dihydroerythromycin-based motilin agonists: optimizing for potency and safety. J Med Chem 52:6851-9 (2009)  
Target
Name:
Motilin receptor
Synonyms:
Type:
Mol. Mass.:
43771.25
Organism:
Oryctolagus cuniculus
Description:
Residue:
400
  
Inhibitor
Name:
BDBM50299521
Synonyms:
2-((2R,3S,4R,5R,6S,7R,9R,10R,11S,12S,13R)-2-ethyl-3,4,9-trihydroxy-10-((2S,3R,4S,6R)-3-hydroxy-4-(isopropyl(methyl)amino)-6-methyltetrahydro-2H-pyran-2-yloxy)-12-((2R,4R,5S,6S)-5-hydroxy-4-methoxy-4,6-dimethyltetrahydro-2H-pyran-2-yloxy)-3,5,7,9,11,13-hexamethyl-14-oxooxacyclotetradecan-6-yloxy)-N-(pyrimidin-4-yl)acetamide | CHEMBL583094
Type:
Small organic molecule
Emp. Form.:
C45H78N4O14
Mol. Mass.:
899.1192
SMILES:
CC[C@H]1OC(=O)[C@H](C)[C@@H](O[C@H]2C[C@@](C)(OC)[C@@H](O)[C@H](C)O2)[C@H](C)[C@@H](O[C@@H]2O[C@H](C)C[C@@H]([C@H]2O)N(C)C(C)C)[C@](C)(O)C[C@@H](C)[C@H](OCC(=O)Nc2ccncn2)[C@H](C)[C@@H](O)[C@]1(C)O
: