Target
Sigma non-opioid intracellular receptor 1
Ligand
BDBM50299713
Substrate
Meas. Tech.
ChEMBL_588694 (CHEMBL1056845)
Ki
>5000±n/a nM
Citation
 Berardi, FAbate, CFerorelli, SUricchio, VColabufo, NANiso, MPerrone, R Exploring the importance of piperazine N-atoms for sigma(2) receptor affinity and activity in a series of analogs of 1-cyclohexyl-4-[3-(5-methoxy-1,2,3,4-tetrahydronaphthalen-1-yl)propyl]piperazine (PB28). J Med Chem 52:7817-28 (2009)  
Target
Name:
Sigma non-opioid intracellular receptor 1
Synonyms:
OPRS1 SIGMAR1 Sigma non-opioid intracellular receptor 1 Sigma1-receptor Sterol isomerase-like protein
Type:
Protein
Mol. Mass.:
25307.17
Organism:
Cavia porcellus (Guinea pig)
Description:
Q60492
Residue:
223
  
Inhibitor
Name:
BDBM50299713
Synonyms:
1-Cyclohexyl-1,4-dimethyl-4-[3-(5-methoxy-1,2,3,4-tetrahydronaphthalen-1-yl)propyl]piperazinium Diiodide | CHEMBL573248
Type:
Small organic molecule
Emp. Form.:
C26H44N2O
Mol. Mass.:
400.6393
SMILES:
COc1cccc2C(CCC[N+]3(C)CC[N+](C)(CC3)C3CCCCC3)CCCc12
: