Target
Cholinesterase
Ligand
BDBM7462
Substrate
Meas. Tech.
ChEMBL_592837 (CHEMBL1045780)
Ki
43100±n/a nM
Citation
 Katalinic, MRusak, GDomacinovic Barovic, JSinko, GJelic, DAntolovic, RKovarik, Z Structural aspects of flavonoids as inhibitors of human butyrylcholinesterase. Eur J Med Chem 45:186-92 (2010)  
Target
Name:
Cholinesterase
Synonyms:
Acylcholine acylhydrolase Butyrylcholine esterase (BChE) Butyrylcholinesterase (BuChE) CHLE_HUMAN Cholinesterases Pseudocholinesterase
Type:
Homotetramer
Mol. Mass.:
68422.27
Organism:
Homo sapiens (Human)
Description:
P06276
Residue:
602
  
Inhibitor
Name:
BDBM7462
Synonyms:
3,5,7-trihydroxy-2-(4-hydroxyphenyl)-4H-chromen-4-one CHEMBL150 Kaempferol (Kmp) kaempferol
Type:
Small organic molecule
Emp. Form.:
C15H10O6
Mol. Mass.:
286.2363
SMILES:
Oc1ccc(cc1)-c1oc2cc(O)cc(O)c2c(=O)c1O
: