Target
Acetylcholinesterase
Ligand
BDBM7460
Substrate
Meas. Tech.
ChEMBL_592838 (CHEMBL1045781)
Ki
38300±n/a nM
Citation
 Katalinic, MRusak, GDomacinovic Barovic, JSinko, GJelic, DAntolovic, RKovarik, Z Structural aspects of flavonoids as inhibitors of human butyrylcholinesterase. Eur J Med Chem 45:186-92 (2010)  
Target
Name:
Acetylcholinesterase
Synonyms:
ACES_HUMAN Acetylcholinesterase (AChE) | Acetylcholinesterase (human AChE)
Type:
Enzyme
Mol. Mass.:
67792.70
Organism:
Homo sapiens (Human)
Description:
P22303
Residue:
614
  
Inhibitor
Name:
BDBM7460
Synonyms:
2-(3,4-dihydroxyphenyl)-3,5,7-trihydroxy-4H-chromen-4-one 2-(3,4-dihydroxyphenyl)-3,5,7-trihydroxy-chromone;hydrate Quercetin Quercetin (21) US11021454, Compound Quercetin med.21724, Compound 4
Type:
Small organic molecule
Emp. Form.:
C15H10O7
Mol. Mass.:
302.2357
SMILES:
Oc1cc(O)c2c(c1)oc(-c1ccc(O)c(O)c1)c(O)c2=O
: