Target
Cyclin-dependent kinase 1/G2/mitotic-specific cyclin-B1/G2/mitotic-specific cyclin-B2/G2/mitotic-specific cyclin-B3
Ligand
BDBM50300060
Substrate
Meas. Tech.
ChEMBL_593422 (CHEMBL1040550)
IC50
>10000±n/a nM
Citation
 Becker, AKohfeld, SLader, APreu, LPies, TWieking, KFerandin, YKnockaert, MMeijer, LKunick, C Development of 5-benzylpaullones and paullone-9-carboxylic acid alkyl esters as selective inhibitors of mitochondrial malate dehydrogenase (mMDH). Eur J Med Chem 45:335-42 (2010)  
Target
Name:
Cyclin-dependent kinase 1/G2/mitotic-specific cyclin-B1/G2/mitotic-specific cyclin-B2/G2/mitotic-specific cyclin-B3
Synonyms:
Cyclin B/Cyclin-Dependent Kinase 1 (CDK1)/G2/mitotic-specific cyclin B2/G2/mitotic-specific cyclin B3 Cyclin-dependent kinase 1/cyclin B
Type:
Mol. Mass.:
Description:
ASSAY_ID of EBI is 40085
Components:
This complex has 4 components.
Component 1
Name:
G2/mitotic-specific cyclin-B3
Synonyms:
CCNB3 CYCB3 G2/mitotic-specific cyclin-B3
Type:
PROTEIN
Mol. Mass.:
157916.84
Organism:
Homo sapiens (Human)
Description:
Residue:
1395
  
Component 2
Name:
G2/mitotic-specific cyclin-B1
Synonyms:
CCNB CCNB1_HUMAN
Type:
Enzyme Subunit
Mol. Mass.:
48340.95
Organism:
Homo sapiens (Human)
Description:
P14635
Residue:
433
  
Component 3
Name:
G2/mitotic-specific cyclin-B2
Synonyms:
CCNB2 Cyclin-dependent kinase 1/cyclin B | G2/mitotic-specific cyclin-B2
Type:
PROTEIN
Mol. Mass.:
45293.13
Organism:
Homo sapiens (Human)
Description:
Residue:
398
  
Component 4
Name:
Cyclin-dependent kinase 1
Synonyms:
CDC2 CDK1 CDKN1 Cell division protein kinase 1 P34CDC2 | p34 protein kinase
Type:
Enzyme Subunit
Mol. Mass.:
34101.08
Organism:
Homo sapiens (Human)
Description:
P06493
Residue:
297
  
Inhibitor
Name:
BDBM50300060
Synonyms:
5-Benzyl-9-chloro-7,12-dihydroindolo[3,2-d][1]benzazepin-6(5H)-one | CHEMBL574898
Type:
Small organic molecule
Emp. Form.:
C23H17ClN2O
Mol. Mass.:
372.847
SMILES:
Clc1ccc2[nH]c-3c(CC(=O)N(Cc4ccccc4)c4ccccc-34)c2c1
: