Target
Dihydrofolate reductase
Ligand
BDBM50378385
Substrate
Meas. Tech.
ChEMBL_588750 (CHEMBL1053697)
IC50
>100000±n/a nM
Citation
 Ma, XPoon, TYWong, PTChui, WK Synthesis and in vitro evaluation of 2,4-diamino-1,3,5-triazine derivatives as neuronal voltage-gated sodium channel blockers. Bioorg Med Chem Lett 19:5644-7 (2009)  
Target
Name:
Dihydrofolate reductase
Synonyms:
DHFR Dihydrofolate reductase | Dihydrofolate reductase (DHFR)
Type:
Enzyme
Mol. Mass.:
21603.71
Organism:
Bos taurus (Cattle)
Description:
P00376
Residue:
187
  
Inhibitor
Name:
BDBM50378385
Synonyms:
CHEMBL573515
Type:
Small organic molecule
Emp. Form.:
C11H14BrN5
Mol. Mass.:
296.166
SMILES:
CC1(C)NC(Nc2ccccc2Br)=NC(N)=N1
: