Target
Prostaglandin G/H synthase 1
Ligand
BDBM50300789
Substrate
Meas. Tech.
ChEMBL_598706 (CHEMBL1050787)
IC50
11800±n/a nM
Citation
 Abdellatif, KRChowdhury, MADong, YDas, DYu, GVelázquez, CSuresh, MRKnaus, EE Diazen-1-ium-1,2-diolated nitric oxide donor ester prodrugs of 5-(4-carboxymethylphenyl)-1-(4-methanesulfonylphenyl)-3-trifluoromethyl-1H-pyrazole and its aminosulfonyl analog: Synthesis, biological evaluation and nitric oxide release studies. Bioorg Med Chem 17:5182-8 (2009)  
Target
Name:
Prostaglandin G/H synthase 1
Synonyms:
COX1 Cyclooxygenase-1 (COX-1) PTGS1 | Prostaglandin G/H synthase (cyclooxygenase)
Type:
Protein
Mol. Mass.:
68868.60
Organism:
Ovis aries (Sheep)
Description:
Residue:
600
  
Inhibitor
Name:
BDBM50300789
Synonyms:
CHEMBL568723 | O2-Acetoxymethyl-1-{2-[2-(4-(1-(4-methanesulfonylphenyl)-3-trifluoromethyl-1H-pyrazol-5-yl)phenyl)acetoxymethyl]pyrrolidin-1-yl}diazen-1-ium-1,2-diolate
Type:
Small organic molecule
Emp. Form.:
C27H28F3N5O8S
Mol. Mass.:
639.6
SMILES:
CC(=O)OCO\N=[N+](/[O-])N1CCC[C@H]1COC(=O)Cc1ccc(cc1)-c1cc(nn1-c1ccc(cc1)S(C)(=O)=O)C(F)(F)F
: