Target
Melanocyte-stimulating hormone receptor
Ligand
BDBM50301130
Substrate
Meas. Tech.
ChEMBL_598563 (CHEMBL1043555)
EC50
310±n/a nM
Citation
 Ruwe, ARKoikov, LAbdel-Malek, ZHaskell-Luevano, CDirain, MLPortillo, FXiang, ZWortman, MKnittel, JJ Semi-rigid tripeptide agonists of melanocortin receptors. Bioorg Med Chem Lett 19:5176-81 (2009)  
Target
Name:
Melanocyte-stimulating hormone receptor
Synonyms:
MC1-R Mc1r Melanocyte-stimulating hormone receptor | Msh-r
Type:
PROTEIN
Mol. Mass.:
35238.60
Organism:
Mus musculus
Description:
ChEMBL_1498846
Residue:
315
  
Inhibitor
Name:
BDBM50301130
Synonyms:
(S)-2-((R)-2-((S)-3-(1H-imidazol-5-yl)-2-(3-(3-(trifluoromethyl)phenyl)acrylamido)propanamido)-3-phenylpropanamido)-5-guanidinopentanamide | CHEMBL569696
Type:
Small organic molecule
Emp. Form.:
C31H36F3N9O4
Mol. Mass.:
655.6706
SMILES:
NC(N)=NCCC[C@@H](NC(=O)[C@@H](Cc1ccccc1)NC(=O)[C@H](Cc1cnc[nH]1)NC(=O)C=Cc1cccc(c1)C(F)(F)F)C(N)=O
: