Target
Melanocyte-stimulating hormone receptor
Ligand
BDBM50301131
Substrate
Meas. Tech.
ChEMBL_598563 (CHEMBL1043555)
EC50
274±n/a nM
Citation
 Ruwe, ARKoikov, LAbdel-Malek, ZHaskell-Luevano, CDirain, MLPortillo, FXiang, ZWortman, MKnittel, JJ Semi-rigid tripeptide agonists of melanocortin receptors. Bioorg Med Chem Lett 19:5176-81 (2009)  
Target
Name:
Melanocyte-stimulating hormone receptor
Synonyms:
MC1-R Mc1r Melanocyte-stimulating hormone receptor | Msh-r
Type:
PROTEIN
Mol. Mass.:
35238.60
Organism:
Mus musculus
Description:
ChEMBL_1498846
Residue:
315
  
Inhibitor
Name:
BDBM50301131
Synonyms:
(S)-5-guanidino-2-((R)-2-((S)-2-(3-(3-hydroxyphenyl)acrylamido)-3-(1H-imidazol-5-yl)propanamido)-3-phenylpropanamido)pentanamide | CHEMBL567240
Type:
Small organic molecule
Emp. Form.:
C30H37N9O5
Mol. Mass.:
603.6721
SMILES:
NC(N)=NCCC[C@@H](NC(=O)[C@@H](Cc1ccccc1)NC(=O)[C@H](Cc1cnc[nH]1)NC(=O)C=Cc1cccc(O)c1)C(N)=O
: