Target
Melanocyte-stimulating hormone receptor
Ligand
BDBM50301150
Substrate
Meas. Tech.
ChEMBL_598563 (CHEMBL1043555)
EC50
1230±n/a nM
Citation
 Ruwe, ARKoikov, LAbdel-Malek, ZHaskell-Luevano, CDirain, MLPortillo, FXiang, ZWortman, MKnittel, JJ Semi-rigid tripeptide agonists of melanocortin receptors. Bioorg Med Chem Lett 19:5176-81 (2009)  
Target
Name:
Melanocyte-stimulating hormone receptor
Synonyms:
MC1-R Mc1r Melanocyte-stimulating hormone receptor | Msh-r
Type:
PROTEIN
Mol. Mass.:
35238.60
Organism:
Mus musculus
Description:
ChEMBL_1498846
Residue:
315
  
Inhibitor
Name:
BDBM50301150
Synonyms:
(S)-2-((R)-2-((S)-2-(4-(4-fluorophenyl)-4-oxobutanamido)-3-(1H-imidazol-5-yl)propanamido)-3-phenylpropanamido)-5-guanidinopentanamide | CHEMBL568836
Type:
Small organic molecule
Emp. Form.:
C31H38FN9O5
Mol. Mass.:
635.6891
SMILES:
NC(N)=NCCC[C@@H](NC(=O)[C@@H](Cc1ccccc1)NC(=O)[C@H](Cc1cnc[nH]1)NC(=O)CCC(=O)c1ccc(F)cc1)C(N)=O
: