Target
Melanocyte-stimulating hormone receptor
Ligand
BDBM50301152
Substrate
Meas. Tech.
ChEMBL_598563 (CHEMBL1043555)
EC50
780±n/a nM
Citation
 Ruwe, ARKoikov, LAbdel-Malek, ZHaskell-Luevano, CDirain, MLPortillo, FXiang, ZWortman, MKnittel, JJ Semi-rigid tripeptide agonists of melanocortin receptors. Bioorg Med Chem Lett 19:5176-81 (2009)  
Target
Name:
Melanocyte-stimulating hormone receptor
Synonyms:
MC1-R Mc1r Melanocyte-stimulating hormone receptor | Msh-r
Type:
PROTEIN
Mol. Mass.:
35238.60
Organism:
Mus musculus
Description:
ChEMBL_1498846
Residue:
315
  
Inhibitor
Name:
BDBM50301152
Synonyms:
CHEMBL568965 | N-((S)-1-((R)-1-((S)-1-amino-5-guanidino-1-oxopentan-2-ylamino)-1-oxo-3-phenylpropan-2-ylamino)-3-(1H-imidazol-5-yl)-1-oxopropan-2-yl)-5-(benzo[d][1,3]dioxol-5-yl)penta-2,4-dienamide
Type:
Small organic molecule
Emp. Form.:
C33H39N9O6
Mol. Mass.:
657.7195
SMILES:
NC(N)=NCCC[C@@H](NC(=O)[C@@H](Cc1ccccc1)NC(=O)[C@H](Cc1cnc[nH]1)NC(=O)C=CC=Cc1ccc2OCOc2c1)C(N)=O
: