Target
Melanocortin receptor 3
Ligand
BDBM50301156
Substrate
Meas. Tech.
ChEMBL_598564 (CHEMBL1043556)
EC50
43700±n/a nM
Citation
 Ruwe, ARKoikov, LAbdel-Malek, ZHaskell-Luevano, CDirain, MLPortillo, FXiang, ZWortman, MKnittel, JJ Semi-rigid tripeptide agonists of melanocortin receptors. Bioorg Med Chem Lett 19:5176-81 (2009)  
Target
Name:
Melanocortin receptor 3
Synonyms:
MC3-R Mc3r
Type:
PROTEIN
Mol. Mass.:
35808.24
Organism:
Mus musculus
Description:
ChEMBL_1498848
Residue:
323
  
Inhibitor
Name:
BDBM50301156
Synonyms:
CHEMBL569694 | Ph(CH2)3CO-His-D-Phe-Arg-NH2
Type:
Small organic molecule
Emp. Form.:
C31H41N9O4
Mol. Mass.:
603.7151
SMILES:
NC(N)=NCCC[C@@H](NC(=O)[C@@H](Cc1ccccc1)NC(=O)[C@H](Cc1cnc[nH]1)NC(=O)CCCc1ccccc1)C(N)=O
: