Target
Melanocortin receptor 4
Ligand
BDBM50301156
Substrate
Meas. Tech.
ChEMBL_598565 (CHEMBL1043557)
EC50
15140±n/a nM
Citation
 Ruwe, ARKoikov, LAbdel-Malek, ZHaskell-Luevano, CDirain, MLPortillo, FXiang, ZWortman, MKnittel, JJ Semi-rigid tripeptide agonists of melanocortin receptors. Bioorg Med Chem Lett 19:5176-81 (2009)  
Target
Name:
Melanocortin receptor 4
Synonyms:
MC4-R Mc4r
Type:
PROTEIN
Mol. Mass.:
36964.43
Organism:
Mus musculus
Description:
ChEMBL_1498850
Residue:
332
  
Inhibitor
Name:
BDBM50301156
Synonyms:
CHEMBL569694 | Ph(CH2)3CO-His-D-Phe-Arg-NH2
Type:
Small organic molecule
Emp. Form.:
C31H41N9O4
Mol. Mass.:
603.7151
SMILES:
NC(N)=NCCC[C@@H](NC(=O)[C@@H](Cc1ccccc1)NC(=O)[C@H](Cc1cnc[nH]1)NC(=O)CCCc1ccccc1)C(N)=O
: