Target
Melanocortin receptor 5
Ligand
BDBM50301130
Substrate
Meas. Tech.
ChEMBL_598566 (CHEMBL1043558)
EC50
6780±n/a nM
Citation
 Ruwe, ARKoikov, LAbdel-Malek, ZHaskell-Luevano, CDirain, MLPortillo, FXiang, ZWortman, MKnittel, JJ Semi-rigid tripeptide agonists of melanocortin receptors. Bioorg Med Chem Lett 19:5176-81 (2009)  
Target
Name:
Melanocortin receptor 5
Synonyms:
MC5R_MOUSE Melanocortin receptor 5 | Melanocortin receptor 5 (MC5R)
Type:
Enzyme
Mol. Mass.:
36966.58
Organism:
Mus musculus (Mouse)
Description:
P41149
Residue:
325
  
Inhibitor
Name:
BDBM50301130
Synonyms:
(S)-2-((R)-2-((S)-3-(1H-imidazol-5-yl)-2-(3-(3-(trifluoromethyl)phenyl)acrylamido)propanamido)-3-phenylpropanamido)-5-guanidinopentanamide | CHEMBL569696
Type:
Small organic molecule
Emp. Form.:
C31H36F3N9O4
Mol. Mass.:
655.6706
SMILES:
NC(N)=NCCC[C@@H](NC(=O)[C@@H](Cc1ccccc1)NC(=O)[C@H](Cc1cnc[nH]1)NC(=O)C=Cc1cccc(c1)C(F)(F)F)C(N)=O
: