Target
Melanocortin receptor 5
Ligand
BDBM50301154
Substrate
Meas. Tech.
ChEMBL_598566 (CHEMBL1043558)
EC50
23600±n/a nM
Citation
 Ruwe, ARKoikov, LAbdel-Malek, ZHaskell-Luevano, CDirain, MLPortillo, FXiang, ZWortman, MKnittel, JJ Semi-rigid tripeptide agonists of melanocortin receptors. Bioorg Med Chem Lett 19:5176-81 (2009)  
Target
Name:
Melanocortin receptor 5
Synonyms:
MC5R_MOUSE Melanocortin receptor 5 | Melanocortin receptor 5 (MC5R)
Type:
Enzyme
Mol. Mass.:
36966.58
Organism:
Mus musculus (Mouse)
Description:
P41149
Residue:
325
  
Inhibitor
Name:
BDBM50301154
Synonyms:
CHEMBL569086 | N-((S)-1-((R)-1-((S)-1-amino-5-guanidino-1-oxopentan-2-ylamino)-1-oxo-3-phenylpropan-2-ylamino)-3-(1H-imidazol-5-yl)-1-oxopropan-2-yl)benzo[d][1,3]dioxole-5-carboxamide
Type:
Small organic molecule
Emp. Form.:
C29H35N9O6
Mol. Mass.:
605.6449
SMILES:
NC(N)=NCCC[C@@H](NC(=O)[C@@H](Cc1ccccc1)NC(=O)[C@H](Cc1cnc[nH]1)NC(=O)c1ccc2OCOc2c1)C(N)=O
: