Target
Protein-tyrosine kinase 2-beta
Ligand
BDBM50301364
Substrate
Meas. Tech.
ChEMBL_599543 (CHEMBL1037538)
IC50
53±n/a nM
Citation
 Allen, JGLee, MRHan, CYScherrer, JFlynn, SBoucher, CZhao, HO'Connor, ABRoveto, PBauer, DGraceffa, RRichards, WGBabij, P Identification of small molecule inhibitors of proline-rich tyrosine kinase 2 (Pyk2) with osteogenic activity in osteoblast cells. Bioorg Med Chem Lett 19:4924-8 (2009)  
Target
Name:
Protein-tyrosine kinase 2-beta
Synonyms:
FAK2 PTK2B PTK2B protein tyrosine kinase 2 beta (PTK2B) Protein tyrosine kinase 2 beta | RAFTK
Type:
Protein
Mol. Mass.:
115868.80
Organism:
Homo sapiens (Human)
Description:
Q14289
Residue:
1009
  
Inhibitor
Name:
BDBM50301364
Synonyms:
CHEMBL570380 | N-(5-(6,7-dimethoxyquinolin-4-yloxy)pyridin-2-yl)-2-oxo-1-phenyl-5-(thiophen-2-yl)-1,2-dihydropyridine-3-carboxamide
Type:
Small organic molecule
Emp. Form.:
C32H24N4O5S
Mol. Mass.:
576.622
SMILES:
COc1cc2nccc(Oc3ccc(NC(=O)c4cc(cn(-c5ccccc5)c4=O)-c4cccs4)nc3)c2cc1OC
: