Target
Carbonic anhydrase 2
Ligand
BDBM33267
Substrate
Meas. Tech.
ChEMBL_599730 (CHEMBL1048174)
Ki
106±n/a nM
Citation
 Maresca, ACarta, FVullo, DScozzafava, ASupuran, CT Carbonic anhydrase inhibitors. Inhibition of the Rv1284 and Rv3273 beta-carbonic anhydrases from Mycobacterium tuberculosis with diazenylbenzenesulfonamides. Bioorg Med Chem Lett 19:4929-32 (2009)  
Target
Name:
Carbonic anhydrase 2
Synonyms:
CA-II CAC Carbonate dehydratase II Carbonic anhydrase 2 (CA-II) Carbonic anhydrase C Carbonic anhydrase II (CA-II) Carbonic anhydrase II (hCA II) | Carbonic anhydrase isoenzyme II (hCA II)
Type:
Enzyme
Mol. Mass.:
29250.71
Organism:
Homo sapiens (Human)
Description:
P00918
Residue:
260
  
Inhibitor
Name:
BDBM33267
Synonyms:
azo-sulfonamide, 1b
Type:
Small organic molecule
Emp. Form.:
C12H12N4O2S
Mol. Mass.:
276.314
SMILES:
Nc1ccc(cc1)\N=N\c1ccc(cc1)S(N)(=O)=O
: