Target
Xanthine dehydrogenase/oxidase
Ligand
BDBM35440
Substrate
Meas. Tech.
ChEMBL_600479 (CHEMBL1046426)
IC50
21200±n/a nM
Citation
 Yang, LXHuang, KXLi, HBGong, JXWang, FFeng, YBTao, QFWu, YHLi, XKWu, XMZeng, SSpencer, SZhao, YQu, J Design, synthesis, and examination of neuron protective properties of alkenylated and amidated dehydro-silybin derivatives. J Med Chem 52:7732-52 (2009)  
Target
Name:
Xanthine dehydrogenase/oxidase
Synonyms:
XD XO Xanthine oxidase Xdh
Type:
PROTEIN
Mol. Mass.:
146252.77
Organism:
Rattus norvegicus
Description:
ChEMBL_1296864
Residue:
1331
  
Inhibitor
Name:
BDBM35440
Synonyms:
ALLOPURINOL SMR000059083 | cid_2094
Type:
Small organic molecule
Emp. Form.:
C5H4N4O
Mol. Mass.:
136.1115
SMILES:
O=c1[nH]cnc2n[nH]cc12
: