Target
Melanin-concentrating hormone receptor 1
Ligand
BDBM50301704
Substrate
Meas. Tech.
ChEMBL_597858 (CHEMBL1039121)
IC50
0.22±n/a nM
Citation
 Suzuki, TKameda, MAndo, MMiyazoe, HSekino, EIto, SMasutani, KKamijo, KTakezawa, AMoriya, MIto, MIto, JNakase, KMatsushita, HIshihara, ATakenaga, NTokita, SKanatani, ASato, NFukami, T Discovery of novel diarylketoxime derivatives as selective and orally active melanin-concentrating hormone 1 receptor antagonists. Bioorg Med Chem Lett 19:5339-45 (2009)  
Target
Name:
Melanin-concentrating hormone receptor 1
Synonyms:
G-protein coupled receptor 24 MCH receptor 1 MCH-R1 MCHR-1 MCHR1_HUMAN Melanin-Concentrating Hormone Receptor 1 (MCH1R) Melanin-concentrating hormone receptor 1 (MCH-1) Melanin-concentrating hormone receptor 1 (MCHR-1) SLC-1 Somatostatin receptor-like protein
Type:
G Protein-Coupled Receptor (GPCR)
Mol. Mass.:
45976.27
Organism:
Homo sapiens (Human)
Description:
Membranes from CHO-K1 cells stably expressing human MCH1R were used in assays.
Residue:
422
  
Inhibitor
Name:
BDBM50301704
Synonyms:
(Z)-(3,4-difluorophenyl)(4-((6-fluoro-1H-spiro[furo[3,4-c]pyridine-3,4'-piperidine]-1'-yl)methyl)phenyl)methanone O-methyl oxime | CHEMBL566880
Type:
Small organic molecule
Emp. Form.:
C26H24F3N3O2
Mol. Mass.:
467.4829
SMILES:
CO\N=C(\c1ccc(CN2CCC3(CC2)OCc2cc(F)ncc32)cc1)c1ccc(F)c(F)c1
: