Target
Melanin-concentrating hormone receptor 1
Ligand
BDBM50258478
Substrate
Meas. Tech.
ChEMBL_597858 (CHEMBL1039121)
IC50
0.09±n/a nM
Citation
 Suzuki, TKameda, MAndo, MMiyazoe, HSekino, EIto, SMasutani, KKamijo, KTakezawa, AMoriya, MIto, MIto, JNakase, KMatsushita, HIshihara, ATakenaga, NTokita, SKanatani, ASato, NFukami, T Discovery of novel diarylketoxime derivatives as selective and orally active melanin-concentrating hormone 1 receptor antagonists. Bioorg Med Chem Lett 19:5339-45 (2009)  
Target
Name:
Melanin-concentrating hormone receptor 1
Synonyms:
G-protein coupled receptor 24 MCH receptor 1 MCH-R1 MCHR-1 MCHR1_HUMAN Melanin-Concentrating Hormone Receptor 1 (MCH1R) Melanin-concentrating hormone receptor 1 (MCH-1) Melanin-concentrating hormone receptor 1 (MCHR-1) SLC-1 Somatostatin receptor-like protein
Type:
G Protein-Coupled Receptor (GPCR)
Mol. Mass.:
45976.27
Organism:
Homo sapiens (Human)
Description:
Membranes from CHO-K1 cells stably expressing human MCH1R were used in assays.
Residue:
422
  
Inhibitor
Name:
BDBM50258478
Synonyms:
2-(3,4-difluorophenyl)-N-(3-(6-fluoro-1H-spiro[furo[3,4-c]pyridine-3,4'-piperidine]-1'-yl)propyl)-N-(2-fluoroethyl)-2-(1H-pyrazol-1-yl)acetamide | CHEMBL468099
Type:
Small organic molecule
Emp. Form.:
C27H29F4N5O2
Mol. Mass.:
531.5451
SMILES:
FCCN(CCCN1CCC2(CC1)OCc1cc(F)ncc21)C(=O)C(c1ccc(F)c(F)c1)n1cccn1
: