Target
Sodium/glucose cotransporter 2
Ligand
BDBM50302620
Substrate
Meas. Tech.
ChEMBL_594779 (CHEMBL1040740)
IC50
1900±n/a nM
Citation
 Goodwin, NCMabon, RHarrison, BAShadoan, MKAlmstead, ZYXie, YHealy, JBuhring, LMDaCosta, CMBardenhagen, JMseeh, FLiu, QNouraldeen, AWilson, AGKimball, SDPowell, DRRawlins, DB Novel L-xylose derivatives as selective sodium-dependent glucose cotransporter 2 (SGLT2) inhibitors for the treatment of type 2 diabetes. J Med Chem 52:6201-4 (2009)  
Target
Name:
Sodium/glucose cotransporter 2
Synonyms:
Low affinity sodium-glucose cotransporter SC5A2_MOUSE Slc5a2 Solute carrier family 5 member 2 | sodium-dependent glucose cotransporter 2 (SGLT2)
Type:
Protein
Mol. Mass.:
73014.31
Organism:
Mus musculus (Mouse)
Description:
Q923I7
Residue:
670
  
Inhibitor
Name:
BDBM50302620
Synonyms:
(2S,3R,4R,5S)-2-(4-Chloro-3-(4-ethoxyphenoxy)phenyl)-6-methoxytetrahydro-2H-pyran-3,4,5-triol | CHEMBL567373
Type:
Small organic molecule
Emp. Form.:
C20H23ClO7
Mol. Mass.:
410.845
SMILES:
CCOc1ccc(Oc2cc(ccc2Cl)[C@@H]2OC(OC)[C@@H](O)[C@H](O)[C@H]2O)cc1
: