Target
Sodium/glucose cotransporter 2
Ligand
BDBM50302608
Substrate
Meas. Tech.
ChEMBL_594780 (CHEMBL1040741)
IC50
620±n/a nM
Citation
 Goodwin, NCMabon, RHarrison, BAShadoan, MKAlmstead, ZYXie, YHealy, JBuhring, LMDaCosta, CMBardenhagen, JMseeh, FLiu, QNouraldeen, AWilson, AGKimball, SDPowell, DRRawlins, DB Novel L-xylose derivatives as selective sodium-dependent glucose cotransporter 2 (SGLT2) inhibitors for the treatment of type 2 diabetes. J Med Chem 52:6201-4 (2009)  
Target
Name:
Sodium/glucose cotransporter 2
Synonyms:
Na(+)/glucose cotransporter 2 SGLT2 Sodium-Dependent Glucose Cotransporter 2 (SGLT2) Solute carrier family 5 member 2
Type:
Protein
Mol. Mass.:
72902.00
Organism:
Homo sapiens (Human)
Description:
P31639
Residue:
672
  
Inhibitor
Name:
BDBM50302608
Synonyms:
(3S,4R,5R,6S)-2-(benzyloxy)-6-(4-chloro-3-(4-ethoxybenzyl)phenyl)tetrahydro-2H-pyran-3,4,5-triol | CHEMBL567778
Type:
Small organic molecule
Emp. Form.:
C27H29ClO6
Mol. Mass.:
484.969
SMILES:
CCOc1ccc(Cc2cc(ccc2Cl)[C@@H]2OC(OCc3ccccc3)[C@@H](O)[C@H](O)[C@H]2O)cc1
: