Target
Sodium/glucose cotransporter 2
Ligand
BDBM50302617
Substrate
Meas. Tech.
ChEMBL_594780 (CHEMBL1040741)
IC50
32±n/a nM
Citation
 Goodwin, NCMabon, RHarrison, BAShadoan, MKAlmstead, ZYXie, YHealy, JBuhring, LMDaCosta, CMBardenhagen, JMseeh, FLiu, QNouraldeen, AWilson, AGKimball, SDPowell, DRRawlins, DB Novel L-xylose derivatives as selective sodium-dependent glucose cotransporter 2 (SGLT2) inhibitors for the treatment of type 2 diabetes. J Med Chem 52:6201-4 (2009)  
Target
Name:
Sodium/glucose cotransporter 2
Synonyms:
Na(+)/glucose cotransporter 2 SGLT2 Sodium-Dependent Glucose Cotransporter 2 (SGLT2) Solute carrier family 5 member 2
Type:
Protein
Mol. Mass.:
72902.00
Organism:
Homo sapiens (Human)
Description:
P31639
Residue:
672
  
Inhibitor
Name:
BDBM50302617
Synonyms:
(2S,3R,4R,5S)-2-[4-Chloro-3-(4-hydroxy-benzyl)-phenyl]-6-methoxy-tetrahydro-pyran-3,4,5-triol | CHEMBL568164
Type:
Small organic molecule
Emp. Form.:
C19H21ClO6
Mol. Mass.:
380.819
SMILES:
COC1O[C@H]([C@H](O)[C@@H](O)[C@@H]1O)c1ccc(Cl)c(Cc2ccc(O)cc2)c1
: