Target
Sodium/glucose cotransporter 2
Ligand
BDBM50302619
Substrate
Meas. Tech.
ChEMBL_594780 (CHEMBL1040741)
IC50
100±n/a nM
Citation
 Goodwin, NCMabon, RHarrison, BAShadoan, MKAlmstead, ZYXie, YHealy, JBuhring, LMDaCosta, CMBardenhagen, JMseeh, FLiu, QNouraldeen, AWilson, AGKimball, SDPowell, DRRawlins, DB Novel L-xylose derivatives as selective sodium-dependent glucose cotransporter 2 (SGLT2) inhibitors for the treatment of type 2 diabetes. J Med Chem 52:6201-4 (2009)  
Target
Name:
Sodium/glucose cotransporter 2
Synonyms:
Na(+)/glucose cotransporter 2 SGLT2 Sodium-Dependent Glucose Cotransporter 2 (SGLT2) Solute carrier family 5 member 2
Type:
Protein
Mol. Mass.:
72902.00
Organism:
Homo sapiens (Human)
Description:
P31639
Residue:
672
  
Inhibitor
Name:
BDBM50302619
Synonyms:
CHEMBL567572 | [2-Chloro-5-((2S,3R,4R,5S,6S)-3,4,5-trihydroxy-6-methoxy-tetrahydro-pyran-2-yl)-phenyl]-(4-ethoxy-phenyl)-methanone
Type:
Small organic molecule
Emp. Form.:
C21H23ClO7
Mol. Mass.:
422.856
SMILES:
CCOc1ccc(cc1)C(=O)c1cc(ccc1Cl)[C@@H]1O[C@@H](OC)[C@@H](O)[C@H](O)[C@H]1O
: