Target
Sodium/glucose cotransporter 2
Ligand
BDBM50302625
Substrate
Meas. Tech.
ChEMBL_594779 (CHEMBL1040740)
IC50
15.0±n/a nM
Citation
 Goodwin, NCMabon, RHarrison, BAShadoan, MKAlmstead, ZYXie, YHealy, JBuhring, LMDaCosta, CMBardenhagen, JMseeh, FLiu, QNouraldeen, AWilson, AGKimball, SDPowell, DRRawlins, DB Novel L-xylose derivatives as selective sodium-dependent glucose cotransporter 2 (SGLT2) inhibitors for the treatment of type 2 diabetes. J Med Chem 52:6201-4 (2009)  
Target
Name:
Sodium/glucose cotransporter 2
Synonyms:
Low affinity sodium-glucose cotransporter SC5A2_MOUSE Slc5a2 Solute carrier family 5 member 2 | sodium-dependent glucose cotransporter 2 (SGLT2)
Type:
Protein
Mol. Mass.:
73014.31
Organism:
Mus musculus (Mouse)
Description:
Q923I7
Residue:
670
  
Inhibitor
Name:
BDBM50302625
Synonyms:
(2S,3R,4R,5S)-2-(4-chloro-3-(4-ethoxybenzyl)phenyl)-6-isopropoxytetrahydro-2H-pyran-3,4,5-triol | CHEMBL585876
Type:
Small organic molecule
Emp. Form.:
C23H29ClO6
Mol. Mass.:
436.926
SMILES:
CCOc1ccc(Cc2cc(ccc2Cl)[C@@H]2OC(OC(C)C)[C@@H](O)[C@H](O)[C@H]2O)cc1
: