Target
Serine racemase
Ligand
BDBM50378532
Substrate
Meas. Tech.
ChEMBL_594810 (CHEMBL1042549)
IC50
370000±n/a nM
Citation
 Hoffman, HEJirásková, JCígler, PSanda, MSchraml, JKonvalinka, J Hydroxamic acids as a novel family of serine racemase inhibitors: mechanistic analysis reveals different modes of interaction with the pyridoxal-5'-phosphate cofactor. J Med Chem 52:6032-41 (2009)  
Target
Name:
Serine racemase
Synonyms:
D-serine ammonia-lyase L-serine ammonia-lyase SRR_MOUSE | Srr
Type:
PROTEIN
Mol. Mass.:
36355.92
Organism:
Mus musculus
Description:
ChEMBL_1441161
Residue:
339
  
Inhibitor
Name:
BDBM50378532
Synonyms:
CHEMBL569435
Type:
Small organic molecule
Emp. Form.:
C3H6N2O4
Mol. Mass.:
134.0907
SMILES:
ONC(=O)CC(=O)NO
: