Target
Tyrosine-protein kinase JAK2
Ligand
BDBM50303076
Substrate
Meas. Tech.
ChEMBL_597287 (CHEMBL1044318)
IC50
0.6±n/a nM
Citation
 Ledeboer, MWPierce, ACDuffy, JPGao, HMessersmith, DSalituro, FGNanthakumar, SCome, JZuccola, HJSwenson, LShlyakter, DMahajan, SHoock, TFan, BTsai, WJKolaczkowski, ECarrier, SHogan, JKZessis, RPazhanisamy, SBennani, YL 2-Aminopyrazolo[1,5-a]pyrimidines as potent and selective inhibitors of JAK2. Bioorg Med Chem Lett 19:6529-33 (2009)  
Target
Name:
Tyrosine-protein kinase JAK2
Synonyms:
JAK-2 JAK2_HUMAN Janus kinase 2 (JAK2) | Janus kinase 2 (a protein tyrosine kinase)
Type:
Protein
Mol. Mass.:
130684.68
Organism:
Homo sapiens (Human)
Description:
O60674
Residue:
1132
  
Inhibitor
Name:
BDBM50303076
Synonyms:
(R)-3-(6-(1-(4-fluorophenyl)-2-methylpropylamino)pyrimidin-4-yl)pyrazolo[1,5-a]pyrimidin-2-amine | CHEMBL570217
Type:
Small organic molecule
Emp. Form.:
C20H20FN7
Mol. Mass.:
377.4181
SMILES:
CC(C)[C@@H](Nc1cc(ncn1)-c1c(N)nn2cccnc12)c1ccc(F)cc1
: