Target
Lipoxygenase
Ligand
BDBM4375
Substrate
Meas. Tech.
ChEMBL_594906 (CHEMBL1040777)
IC50
4000±n/a nM
Citation
 Chowdhury, MAAbdellatif, KRDong, YDas, DYu, GVelázquez, CASuresh, MRKnaus, EE Synthesis and biological evaluation of salicylic acid and N-acetyl-2-carboxybenzenesulfonamide regioisomers possessing a N-difluoromethyl-1,2-dihydropyrid-2-one pharmacophore: dual inhibitors of cyclooxygenases and 5-lipoxygenase with anti-inflammatory activity. Bioorg Med Chem Lett 19:6855-61 (2009)  
Target
Name:
Lipoxygenase
Synonyms:
5-Lipoxygenase | 5-Lipoxygenase (5-LO)
Type:
Enzyme
Mol. Mass.:
97294.59
Organism:
Solanum tuberosum (potato)
Description:
Residue:
864
  
Inhibitor
Name:
BDBM4375
Synonyms:
(2E)-3-(3,4-dihydroxyphenyl)prop-2-enoic acid 3,4-Dihydroxycinnamate, XVII Caffeic acid cid_689043
Type:
Small organic molecule
Emp. Form.:
C9H8O4
Mol. Mass.:
180.1574
SMILES:
OC(=O)\C=C\c1ccc(O)c(O)c1
: