Target
Sodium-dependent serotonin transporter
Ligand
BDBM50303314
Substrate
Meas. Tech.
ChEMBL_595537 (CHEMBL1048772)
Ki
0.1±n/a nM
Citation
 Kaur, HIzenwasser, SVerma, AWade, DHousman, AStevens, EDMobley, DLTrudell, ML Synthesis and monoamine transporter affinity of 3alpha-arylmethoxy-3beta-arylnortropanes. Bioorg Med Chem Lett 19:6865-8 (2009)  
Target
Name:
Sodium-dependent serotonin transporter
Synonyms:
5-HT Transporter 5HT transporter Anandamid membrane transporter, AMT Monoamine transporters; Norepinephrine & serotonin Slc6a4 Sodium-dependent serotonin transporter (SERT) | imipramine receptor
Type:
Multi-pass membrane protein
Mol. Mass.:
70168.43
Organism:
Rattus norvegicus (rat)
Description:
P31652
Residue:
630
  
Inhibitor
Name:
BDBM50303314
Synonyms:
3-alpha-(4-Chlorophenyl)methoxy-3-beta-(4-chlorophenyl)-nortropane | CHEMBL566845
Type:
Small organic molecule
Emp. Form.:
C20H21Cl2NO
Mol. Mass.:
362.293
SMILES:
Clc1ccc(COC2(CC3CCC(C2)N3)c2ccc(Cl)cc2)cc1
: