Target
Pteridine reductase 1
Ligand
BDBM50303508
Substrate
Meas. Tech.
ChEMBL_596055 (CHEMBL1037349)
Ki
>27000±n/a nM
Citation
 Tulloch, LBMartini, VPIulek, JHuggan, JKLee, JHGibson, CLSmith, TKSuckling, CJHunter, WN Structure-based design of pteridine reductase inhibitors targeting African sleeping sickness and the leishmaniases. J Med Chem 53:221-9 (2010)  
Target
Name:
Pteridine reductase 1
Synonyms:
HMTXR PTR1_LEIMA
Type:
PROTEIN
Mol. Mass.:
30459.34
Organism:
Leishmania major
Description:
ChEMBL_1470027
Residue:
288
  
Inhibitor
Name:
BDBM50303508
Synonyms:
2-amino-5-(2-phenylethyl)-3,7-dihydro-4H-pyrrolo[2,3-d]pyrimidin-4-one CHEMBL567351
Type:
Small organic molecule
Emp. Form.:
C14H14N4O
Mol. Mass.:
254.2872
SMILES:
Nc1nc2[nH]cc(CCc3ccccc3)c2c(=O)[nH]1
: