Target
Mitogen-activated protein kinase 10
Ligand
BDBM50303641
Substrate
Meas. Tech.
ChEMBL_596583 (CHEMBL1042602)
IC50
79±n/a nM
Citation
 Kamenecka, TJiang, RSong, XDuckett, DChen, WLing, YYHabel, JLaughlin, JDChambers, JFiguera-Losada, MCameron, MDLin, LRuiz, CHLoGrasso, PV Synthesis, biological evaluation, X-ray structure, and pharmacokinetics of aminopyrimidine c-jun-N-terminal kinase (JNK) inhibitors. J Med Chem 53:419-31 (2010)  
Target
Name:
Mitogen-activated protein kinase 10
Synonyms:
JNK3 MAP kinase p49 3F12 MK10_HUMAN Mitogen-activated protein kinase 10 (Stress-activated protein kinase JNK3) (c-Jun N-terminal kinase 3) (MAP kinase p49 3F12) PRKM10 Stress-activated protein kinase JNK3 | c-Jun N-terminal kinase 3 (JNK3)
Type:
Enzyme
Mol. Mass.:
52586.89
Organism:
Homo sapiens (Human)
Description:
Residue:
464
  
Inhibitor
Name:
BDBM50303641
Synonyms:
3-(2-(4-(3-Methyl-1H-1,2,4-triazol-1-yl)phenylamino)pyrimidin-4-yl)-5-morpholinobenzonitrile | CHEMBL570554
Type:
Small organic molecule
Emp. Form.:
C24H22N8O
Mol. Mass.:
438.4845
SMILES:
Cc1ncn(n1)-c1ccc(Nc2nccc(n2)-c2cc(cc(c2)N2CCOCC2)C#N)cc1
: