Target
Glucocorticoid receptor
Ligand
BDBM50303827
Substrate
Meas. Tech.
ChEMBL_594763 (CHEMBL1039873)
Ki
1±n/a nM
Citation
 Xiao, HYWu, DRMalley, MFGougoutas, JZHabte, SFCunningham, MDSomerville, JEDodd, JHBarrish, JCNadler, SGDhar, TG Novel synthesis of the hexahydroimidazo[1,5b]isoquinoline scaffold: application to the synthesis of glucocorticoid receptor modulators. J Med Chem 53:1270-80 (2010)  
Target
Name:
Glucocorticoid receptor
Synonyms:
GCR_HUMAN GRL Glucocorticoid receptor (GRFP) Nuclear receptor subfamily 3 group C member 1
Type:
Enzyme
Mol. Mass.:
85656.87
Organism:
Homo sapiens (Human)
Description:
P04150
Residue:
777
  
Inhibitor
Name:
BDBM50303827
Synonyms:
(S)-1-((5aR,6S)-1-(4-fluorophenyl)-5a-methyl-5,5a,6,7,8,9-hexahydroimidazo[1,5-b]isoquinolin-6-yl)-1-phenylethanol | CHEMBL569544
Type:
Small organic molecule
Emp. Form.:
C26H27FN2O
Mol. Mass.:
402.5038
SMILES:
C[C@](O)([C@H]1CCCC2=Cc3c(ncn3C[C@]12C)-c1ccc(F)cc1)c1ccccc1
: