Target
Tryptophan 2,3-dioxygenase
Ligand
BDBM50303901
Substrate
Meas. Tech.
ChEMBL_595175 (CHEMBL1040017)
IC50
>10000±n/a nM
Citation
 Röhrig, UFAwad, LGrosdidier, ALarrieu, PStroobant, VColau, DCerundolo, VSimpson, AJVogel, PVan den Eynde, BJZoete, VMichielin, O Rational design of indoleamine 2,3-dioxygenase inhibitors. J Med Chem 53:1172-89 (2010)  
Target
Name:
Tryptophan 2,3-dioxygenase
Synonyms:
T23O_MOUSE TRPO Tdo2 Tryptophan oxygenase Tryptophanase
Type:
PROTEIN
Mol. Mass.:
47757.90
Organism:
Mus musculus
Description:
ChEMBL_1452150
Residue:
406
  
Inhibitor
Name:
BDBM50303901
Synonyms:
1,4-Dihydroxynaphthalene 1,4-naphthalenediol Naphthalene-1,4-diol
Type:
Small organic molecule
Emp. Form.:
C10H8O2
Mol. Mass.:
160.1693
SMILES:
Oc1ccc(O)c2ccccc12
: