Target
Asialoglycoprotein receptor 1
Ligand
BDBM50304488
Substrate
Meas. Tech.
ChEMBL_603824 (CHEMBL1042964)
IC50
2831000±n/a nM
Citation
 Stokmaier, DKhorev, OCutting, BBorn, RRicklin, DErnst, TOBöni, FSchwingruber, KGentner, MWittwer, MSpreafico, MVedani, ARabbani, SSchwardt, OErnst, B Design, synthesis and evaluation of monovalent ligands for the asialoglycoprotein receptor (ASGP-R). Bioorg Med Chem 17:7254-64 (2009)  
Target
Name:
Asialoglycoprotein receptor 1
Synonyms:
ASGP-R 1 ASGR1 CLEC4H1 | Hepatic lectin H1
Type:
PROTEIN
Mol. Mass.:
33177.60
Organism:
Homo sapiens (Human)
Description:
ChEMBL_603824
Residue:
291
  
Inhibitor
Name:
BDBM50304488
Synonyms:
(2S,3R,4S,5S,6R)-2,3,4,5-tetramethoxy-6-(methoxymethyl)tetrahydro-2H-pyran | CHEMBL594347
Type:
Small organic molecule
Emp. Form.:
C11H22O6
Mol. Mass.:
250.2888
SMILES:
COC[C@H]1O[C@H](OC)[C@H](OC)[C@@H](OC)[C@H]1OC
: