Target
Oxysterols receptor LXR-beta
Ligand
BDBM50378593
Substrate
Meas. Tech.
ChEMBL_605690 (CHEMBL1071220)
IC50
9±n/a nM
Citation
 Singhaus, RRBernotas, RCSteffan, RMatelan, EQuinet, ENambi, PFeingold, IHuselton, CWilhelmsson, AGoos-Nilsson, AWrobel, J 3-(3-Aryloxyaryl)imidazo[1,2-a]pyridine sulfones as liver X receptor agonists. Bioorg Med Chem Lett 20:521-5 (2010)  
Target
Name:
Oxysterols receptor LXR-beta
Synonyms:
LXRB Liver X, LXR beta NR1H2 Nuclear receptor NER Ubiquitously-expressed nuclear receptor
Type:
Enzyme Catalytic Domain
Mol. Mass.:
50978.79
Organism:
Homo sapiens (Human)
Description:
P55055
Residue:
460
  
Inhibitor
Name:
BDBM50378593
Synonyms:
CHEMBL612007
Type:
Small organic molecule
Emp. Form.:
C25H22F3N3O3S2
Mol. Mass.:
533.586
SMILES:
CS(=O)(=O)c1cccc(Oc2cccc(c2)-c2c(CN3CCSC3)nc3c(cccn23)C(F)(F)F)c1
: