Target
Oxysterols receptor LXR-beta
Ligand
BDBM50306024
Substrate
Meas. Tech.
ChEMBL_605690 (CHEMBL1071220)
IC50
>1000±n/a nM
Citation
 Singhaus, RRBernotas, RCSteffan, RMatelan, EQuinet, ENambi, PFeingold, IHuselton, CWilhelmsson, AGoos-Nilsson, AWrobel, J 3-(3-Aryloxyaryl)imidazo[1,2-a]pyridine sulfones as liver X receptor agonists. Bioorg Med Chem Lett 20:521-5 (2010)  
Target
Name:
Oxysterols receptor LXR-beta
Synonyms:
LXRB Liver X, LXR beta NR1H2 Nuclear receptor NER Ubiquitously-expressed nuclear receptor
Type:
Enzyme Catalytic Domain
Mol. Mass.:
50978.79
Organism:
Homo sapiens (Human)
Description:
P55055
Residue:
460
  
Inhibitor
Name:
BDBM50306024
Synonyms:
2-isopropyl-3-(3-(3-(methylsulfonyl)benzyloxy)phenyl)-8-(trifluoromethyl)imidazo[1,2-a]pyridine | CHEMBL596381
Type:
Small organic molecule
Emp. Form.:
C25H23F3N2O3S
Mol. Mass.:
488.522
SMILES:
CC(C)c1nc2c(cccn2c1-c1cccc(OCc2cccc(c2)S(C)(=O)=O)c1)C(F)(F)F
: