Target
Oxysterols receptor LXR-alpha
Ligand
BDBM50305077
Substrate
Meas. Tech.
ChEMBL_605689 (CHEMBL1071219)
EC50
31±n/a nM
Citation
 Singhaus, RRBernotas, RCSteffan, RMatelan, EQuinet, ENambi, PFeingold, IHuselton, CWilhelmsson, AGoos-Nilsson, AWrobel, J 3-(3-Aryloxyaryl)imidazo[1,2-a]pyridine sulfones as liver X receptor agonists. Bioorg Med Chem Lett 20:521-5 (2010)  
Target
Name:
Oxysterols receptor LXR-alpha
Synonyms:
LXRA Liver X receptor alpha Liver X receptor alpha (NR1H3) NR1H3 Nuclear orphan receptor LXR-alpha | Nuclear receptor subfamily 1 group H member 3
Type:
Enzyme Catalytic Domain
Mol. Mass.:
50403.85
Organism:
Homo sapiens (Human)
Description:
Q13133
Residue:
447
  
Inhibitor
Name:
BDBM50305077
Synonyms:
3-methyl-4-(3-(3-(methylsulfonyl)phenoxy)phenyl)-8-(trifluoromethyl)quinoline | CHEMBL595689
Type:
Small organic molecule
Emp. Form.:
C24H18F3NO3S
Mol. Mass.:
457.465
SMILES:
Cc1cnc2c(cccc2c1-c1cccc(Oc2cccc(c2)S(C)(=O)=O)c1)C(F)(F)F
: