Target
Trifunctional purine biosynthetic protein adenosine-3
Ligand
BDBM18796
Substrate
Meas. Tech.
ChEMBL_610927 (CHEMBL1067650)
IC50
30000±n/a nM
Citation
 Wang, LCherian, CDesmoulin, SKPolin, LDeng, YWu, JHou, ZWhite, KKushner, JMatherly, LHGangjee, A Synthesis and antitumor activity of a novel series of 6-substituted pyrrolo[2,3-d]pyrimidine thienoyl antifolate inhibitors of purine biosynthesis with selectivity for high affinity folate receptors and the proton-coupled folate transporter over the reduced folate carrier for cellular entry. J Med Chem 53:1306-18 (2010)  
Target
Name:
Trifunctional purine biosynthetic protein adenosine-3
Synonyms:
GAR Tfase GART Glycinamide ribonucleotide transformylase (GAR Tfase) PRGS Thymidylate synthase/GAR transformylase/AICAR transformylase
Type:
Protein
Mol. Mass.:
107768.47
Organism:
Homo sapiens (Human)
Description:
P22102
Residue:
1010
  
Inhibitor
Name:
BDBM18796
Synonyms:
(2S)-2-{[4-(2-{2-amino-4-oxo-1H,4H,7H-pyrrolo[2,3-d]pyrimidin-5-yl}ethyl)phenyl]formamido}pentanedioic acid Pemetrexed
Type:
Small organic molecule
Emp. Form.:
C20H21N5O6
Mol. Mass.:
427.4106
SMILES:
Nc1nc2[nH]cc(CCc3ccc(cc3)C(=O)N[C@@H](CCC(O)=O)C(O)=O)c2c(=O)[nH]1
: