Target
Proton-coupled folate transporter
Ligand
BDBM50306576
Substrate
Meas. Tech.
ChEMBL_610924 (CHEMBL1067647)
pH
5.5±n/a
Ki
130±n/a nM
Comments
extracted
Citation
 Wang, LCherian, CDesmoulin, SKPolin, LDeng, YWu, JHou, ZWhite, KKushner, JMatherly, LHGangjee, A Synthesis and antitumor activity of a novel series of 6-substituted pyrrolo[2,3-d]pyrimidine thienoyl antifolate inhibitors of purine biosynthesis with selectivity for high affinity folate receptors and the proton-coupled folate transporter over the reduced folate carrier for cellular entry. J Med Chem 53:1306-18 (2010)  
Target
Name:
Proton-coupled folate transporter
Synonyms:
G21 Heme carrier protein 1 PCFT/HCP1 SLC46A1 | Solute carrier family 46 member 1
Type:
PROTEIN
Mol. Mass.:
49782.13
Organism:
Homo sapiens (Human)
Description:
ChEMBL_1469597
Residue:
459
  
Inhibitor
Name:
BDBM50306576
Synonyms:
(S)-2-({5-[4-(2-Amino-4-oxo-4,7-dihydro-3H-pyrrolo[2,3-d]-pyrimidin-6-yl)-butyl]-thiophene-2-carbonyl}-amino)-pentanedioicAcid CHEMBL590740
Type:
Small organic molecule
Emp. Form.:
C20H23N5O6S
Mol. Mass.:
461.492
SMILES:
Nc1nc2[nH]c(CCCCc3ccc(s3)C(=O)N[C@@H](CCC(O)=O)C(O)=O)cc2c(=O)[nH]1
: