Target
Myelin-associated glycoprotein
Ligand
BDBM50378599
Substrate
Meas. Tech.
ChEMBL_611876 (CHEMBL1070831)
Kd
13000±n/a nM
Citation
 Mesch, SMoser, DStrasser, DSKelm, ACutting, BRossato, GVedani, AKoliwer-Brandl, HWittwer, MRabbani, SSchwardt, OKelm, SErnst, B Low molecular weight antagonists of the myelin-associated glycoprotein: synthesis, docking, and biological evaluation. J Med Chem 53:1597-615 (2010)  
Target
Name:
Myelin-associated glycoprotein
Synonyms:
MAG_MOUSE Siglec-4a
Type:
PROTEIN
Mol. Mass.:
69368.91
Organism:
Mus musculus
Description:
ChEMBL_663794
Residue:
627
  
Inhibitor
Name:
BDBM50378599
Synonyms:
CHEMBL603912
Type:
Small organic molecule
Emp. Form.:
C25H27ClFN2O9
Mol. Mass.:
553.942
SMILES:
CC(=O)N[C@@H]1[C@@H](O)C[C@](OCc2ccc(F)cc2)(O[C@H]1[C@H](O)[C@H](O)CNC(=O)c1ccc(Cl)cc1)C([O-])=O
: