Target
Proto-oncogene tyrosine-protein kinase receptor Ret
Ligand
BDBM50307129
Substrate
Meas. Tech.
ChEMBL_610305 (CHEMBL1071417)
IC50
210±n/a nM
Citation
 Mologni, LRostagno, RBrussolo, SKnowles, PPKjaer, SMurray-Rust, JRosso, EZambon, AScapozza, LMcDonald, NQLucchini, VGambacorti-Passerini, C Synthesis, structure-activity relationship and crystallographic studies of 3-substituted indolin-2-one RET inhibitors. Bioorg Med Chem 18:1482-96 (2010)  
Target
Name:
Proto-oncogene tyrosine-protein kinase receptor Ret
Synonyms:
CDHF12 Cadherin family member 12 Proto-oncogene c-Ret RET51 Tyrosine-protein kinase Ret (RET)
Type:
Protein
Mol. Mass.:
124318.29
Organism:
Homo sapiens (Human)
Description:
P07949
Residue:
1114
  
Inhibitor
Name:
BDBM50307129
Synonyms:
3-((4-(dimethylamino)naphthalen-1-yl)methylene)-4-methylindolin-2-one | CHEMBL597960
Type:
Small organic molecule
Emp. Form.:
C22H20N2O
Mol. Mass.:
328.407
SMILES:
CN(C)c1ccc(\C=C2/C(=O)Nc3cccc(C)c23)c2ccccc12
: