Target
Coagulation factor IX
Ligand
BDBM50307348
Substrate
Meas. Tech.
ChEMBL_610633 (CHEMBL1069647)
Ki
24200±n/a nM
Citation
 Wang, SBeck, RBlench, TBurd, ABuxton, SMalic, MAyele, TShaikh, SChahwala, SChander, CHolland, RMerette, SZhao, LBlackney, MWatts, A Studies of benzothiophene template as potent factor IXa (FIXa) inhibitors in thrombosis. J Med Chem 53:1465-72 (2010)  
Target
Name:
Coagulation factor IX
Synonyms:
Christmas factor Coagulation factor IX/VIII Coagulation factor IXa heavy chain F9 Factor IX Factor IXa (fIXa) Plasma thromboplastin component
Type:
Enzyme
Mol. Mass.:
51768.83
Organism:
Homo sapiens (Human)
Description:
P00740
Residue:
461
  
Inhibitor
Name:
BDBM50307348
Synonyms:
6-(3,4-Dimethoxy-phenyl)-benzo[b]thiophene-2-carboxamidine | CHEMBL599413
Type:
Small organic molecule
Emp. Form.:
C23H20N2O2S
Mol. Mass.:
388.482
SMILES:
COc1ccc(cc1OC)-c1cccc(c1)-c1ccc2sc(cc2c1)C(N)=N
: