Target
15-hydroxyprostaglandin dehydrogenase [NAD(+)]
Ligand
BDBM50378625
Substrate
Meas. Tech.
ChEMBL_610636 (CHEMBL1069650)
IC50
750±n/a nM
Citation
 Wu, YTai, HHCho, H Synthesis and SAR of thiazolidinedione derivatives as 15-PGDH inhibitors. Bioorg Med Chem 18:1428-33 (2010)  
Target
Name:
15-hydroxyprostaglandin dehydrogenase [NAD(+)]
Synonyms:
15-PGDH HPGD PGDH_HUMAN SDR36C1
Type:
Enzyme
Mol. Mass.:
28974.46
Organism:
Homo sapiens (Human)
Description:
P15428
Residue:
266
  
Inhibitor
Name:
BDBM50378625
Synonyms:
CHEMBL598175
Type:
Small organic molecule
Emp. Form.:
C17H19NO4S
Mol. Mass.:
333.402
SMILES:
OC1=NC(=O)C(S1)=Cc1ccc(OCCC2CCCCO2)cc1
: