Target
15-hydroxyprostaglandin dehydrogenase [NAD(+)]
Ligand
BDBM118038
Substrate
Meas. Tech.
ChEMBL_610636 (CHEMBL1069650)
IC50
172±n/a nM
Citation
 Wu, YTai, HHCho, H Synthesis and SAR of thiazolidinedione derivatives as 15-PGDH inhibitors. Bioorg Med Chem 18:1428-33 (2010)  
Target
Name:
15-hydroxyprostaglandin dehydrogenase [NAD(+)]
Synonyms:
15-PGDH HPGD PGDH_HUMAN SDR36C1
Type:
Enzyme
Mol. Mass.:
28974.46
Organism:
Homo sapiens (Human)
Description:
P15428
Residue:
266
  
Inhibitor
Name:
BDBM118038
Synonyms:
CHEMBL598880 | US8637558, 62
Type:
Small organic molecule
Emp. Form.:
C19H15NO5S
Mol. Mass.:
369.391
SMILES:
OC1=NC(=O)C(S1)=Cc1ccc(OCC2COc3ccccc3O2)cc1
: