Target
Amine oxidase [flavin-containing] B
Ligand
BDBM50307367
Substrate
Meas. Tech.
ChEMBL_610658 (CHEMBL1071678)
Ki
68±n/a nM
Citation
 Lühr, SVilches-Herrera, MFierro, ARamsay, RREdmondson, DEReyes-Parada, MCassels, BKIturriaga-Vásquez, P 2-Arylthiomorpholine derivatives as potent and selective monoamine oxidase B inhibitors. Bioorg Med Chem 18:1388-95 (2010)  
Target
Name:
Amine oxidase [flavin-containing] B
Synonyms:
AOFB_HUMAN MAOB Monoamine oxidase type B (MAO B) Monoamine oxidase type B (MAOB)
Type:
Protein
Mol. Mass.:
58768.76
Organism:
Homo sapiens (Human)
Description:
P27338
Residue:
520
  
Inhibitor
Name:
BDBM50307367
Synonyms:
(+/-)-2-(4'-Butoxyphenyl)thiomorpholine | CHEMBL597372
Type:
Small organic molecule
Emp. Form.:
C14H21NOS
Mol. Mass.:
251.388
SMILES:
CCCCOc1ccc(cc1)C1CNCCS1
: