Target
Heparanase
Ligand
BDBM50307387
Substrate
Meas. Tech.
ChEMBL_610684 (CHEMBL1072345)
Kd
420±n/a nM
Citation
 Johnstone, KDKaroli, TLiu, LDredge, KCopeman, ELi, CPDavis, KHammond, EBytheway, IKostewicz, EChiu, FCShackleford, DMCharman, SACharman, WNHarenberg, JGonda, TJFerro, V Synthesis and biological evaluation of polysulfated oligosaccharide glycosides as inhibitors of angiogenesis and tumor growth. J Med Chem 53:1686-99 (2010)  
Target
Name:
Heparanase
Synonyms:
Endo-glucoronidase HPA HPR1 HPSE1 HSE1 Heparanase 8 kDa subunit | Heparanase-1
Type:
PROTEIN
Mol. Mass.:
61167.67
Organism:
Homo sapiens (Human)
Description:
ChEMBL_327900
Residue:
543
  
Inhibitor
Name:
BDBM50307387
Synonyms:
8-(4-Phenyl[1,2,3]triazol-1-yl)octyl 2,3,4,6-Tetra-O-sulfo-alpha-D-mannopyranosyl-(1->3)-2,4,6-tri-O-sulfo-alpha-D-mannopyranosyl-(1->3)-2,4,6-tri-O-sulfo-alpha-D-mannopyranosyl-(1->3)-2,4,6-tri-O-sulfo-alpha-D-mannopyranosyl-(1->2)-3,4,6-tri-O-sulfo-alpha-D-mannopyranoside,Hexadecasodium Salt | CHEMBL604368
Type:
Small organic molecule
Emp. Form.:
C46H57N3O74S16
Mol. Mass.:
2348.969
SMILES:
[O-]S(=O)(=O)OC[C@H]1O[C@H](O[C@@H]2[C@@H](OCCCCCCCCn3cc(nn3)-c3ccccc3)O[C@H](COS([O-])(=O)=O)[C@@H](OS([O-])(=O)=O)[C@@H]2OS([O-])(=O)=O)[C@@H](OS([O-])(=O)=O)[C@@H](O[C@H]2O[C@H](COS([O-])(=O)=O)[C@@H](OS([O-])(=O)=O)[C@H](O[C@H]3O[C@H](COS([O-])(=O)=O)[C@@H](OS([O-])(=O)=O)[C@H](O[C@H]4O[C@H](COS([O-])(=O)=O)[C@@H](OS([O-])(=O)=O)[C@H](OS([O-])(=O)=O)[C@@H]4OS([O-])(=O)=O)[C@@H]3OS([O-])(=O)=O)[C@@H]2OS([O-])(=O)=O)[C@@H]1OS([O-])(=O)=O
: