Target
Aromatase
Ligand
BDBM50307915
Substrate
Meas. Tech.
ChEMBL_612867 (CHEMBL1067556)
IC50
0.8±n/a nM
Citation
 Woo, LWJackson, TPutey, ACozier, GLeonard, PAcharya, KRChander, SKPurohit, AReed, MJPotter, BV Highly potent first examples of dual aromatase-steroid sulfatase inhibitors based on a biphenyl template. J Med Chem 53:2155-70 (2010)  
Target
Name:
Aromatase
Synonyms:
ARO1 CP19A_HUMAN CYP19 CYPXIX Cytochrome P450 19A1 Cytochrome P450-C19 (CYP19) FL cytokine receptor precursor | P-450AROM
Type:
Enzyme
Mol. Mass.:
57888.92
Organism:
Homo sapiens (Human)
Description:
P11511
Residue:
503
  
Inhibitor
Name:
BDBM50307915
Synonyms:
6-((1H-1,2,4-triazol-1-yl)methyl)-3'-chloro-4'-hydroxybiphenyl-3-carbonitrile | CHEMBL598223
Type:
Small organic molecule
Emp. Form.:
C16H11ClN4O
Mol. Mass.:
310.738
SMILES:
Oc1ccc(cc1Cl)-c1cc(ccc1Cn1cncn1)C#N
: